Target
Carbonic anhydrase
Ligand
BDBM26986
Substrate
Meas. Tech.
ChEMBL_303052 (CHEMBL828021)
Ki
44900000±n/a nM
Citation
 Innocenti, AZimmerman, SFerry, JGScozzafava, ASupuran, CT Carbonic anhydrase inhibitors. Inhibition of the beta-class enzyme from the methanoarchaeon Methanobacterium thermoautotrophicum (Cab) with anions. Bioorg Med Chem Lett 14:4563-7 (2004)  
Target
Name:
Carbonic anhydrase
Synonyms:
Type:
PROTEIN
Mol. Mass.:
19556.84
Organism:
Methanobacterium thermoautotrophicum
Description:
ChEMBL_1280426
Residue:
176
  
Inhibitor
Name:
BDBM26986
Synonyms:
CHEMBL363707 SODIUM BICARBONATE hydrogen carbonate
Type:
Ion
Emp. Form.:
CHO3
Mol. Mass.:
61.0174
SMILES:
OC([O-])=O
: