Target
Carbonic anhydrase 2
Ligand
BDBM50152968
Substrate
Meas. Tech.
ChEMBL_302421 (CHEMBL875204)
Ki
20000±n/a nM
Citation
 Innocenti, AZimmerman, SFerry, JGScozzafava, ASupuran, CT Carbonic anhydrase inhibitors. Inhibition of the beta-class enzyme from the methanoarchaeon Methanobacterium thermoautotrophicum (Cab) with anions. Bioorg Med Chem Lett 14:4563-7 (2004)  
Target
Name:
Carbonic anhydrase 2
Synonyms:
CA-II CAC Carbonate dehydratase II Carbonic anhydrase 2 (CA-II) Carbonic anhydrase C Carbonic anhydrase II (CA-II) Carbonic anhydrase II (hCA II) | Carbonic anhydrase isoenzyme II (hCA II)
Type:
Enzyme
Mol. Mass.:
29250.71
Organism:
Homo sapiens (Human)
Description:
P00918
Residue:
260
  
Inhibitor
Name:
BDBM50152968
Synonyms:
Blausaeure Cyanwasserstoff formonitrile hydrocyanic acid | hydrogen cyanide
Type:
Small organic molecule
Emp. Form.:
CHN
Mol. Mass.:
27.0253
SMILES:
C#N
: