Target
Genome polyprotein/Non-structural protein 4A
Ligand
BDBM50150993
Substrate
Meas. Tech.
ChEMBL_303666 (CHEMBL830427)
Ki
30.0±n/a nM
Citation
 Malancona, SColarusso, SOntoria, JMMarchetti, APoma, MStansfield, ILaufer, RDi Marco, ATaliani, MVerdirame, MGonzalez-Paz, OMatassa, VGNarjes, F SAR and pharmacokinetic studies on phenethylamide inhibitors of the hepatitis C virus NS3/NS4A serine protease. Bioorg Med Chem Lett 14:4575-9 (2004)  
Target
Name:
Genome polyprotein/Non-structural protein 4A
Synonyms:
Hepatitis C virus serine protease, NS3/NS4A
Type:
Mol. Mass.:
Description:
ASSAY_ID of ChEMBL is 1969955
Components:
This complex has 2 components.
Component 1
Name:
Non-structural protein 4A
Synonyms:
Hepatitis C virus NS4A protein Non-structural protein 4A
Type:
PROTEIN
Mol. Mass.:
5762.65
Organism:
Hepatitis C virus
Description:
ChEMBL_305334
Residue:
54
  
Component 2
Name:
Genome polyprotein
Synonyms:
Hepatitis C virus NS3 protease/helicase | Hepatitis C virus serine protease, NS3/NS4A
Type:
Protein
Mol. Mass.:
67067.41
Organism:
Hepatitis C virus
Description:
A3EZI9
Residue:
631
  
Inhibitor
Name:
BDBM50150993
Synonyms:
4-[2-(4,4-Difluoro-2-{[(S)-(R)-1-(2-isobutoxycarbonylamino-3,3-dimethyl-butyryl)-4-(7-methoxy-2-phenyl-quinolin-4-yloxy)-pyrrolidine-2-carbonyl]-amino}-butyrylamino)-ethyl]-3,5-difluoro-benzoic acid | CHEMBL185139
Type:
Small organic molecule
Emp. Form.:
C45H51F4N5O9
Mol. Mass.:
881.9082
SMILES:
COc1ccc2c(O[C@@H]3C[C@H](N(C3)C(=O)C(NC(=O)OCC(C)C)C(C)(C)C)C(=O)N[C@@H](CC(F)F)C(=O)NCCc3c(F)cc(cc3F)C(O)=O)cc(nc2c1)-c1ccccc1
: