Target
Sphingosine 1-phosphate receptor 2
Ligand
BDBM50148394
Substrate
Meas. Tech.
ChEMBL_306054 (CHEMBL833010)
IC50
320±n/a nM
Citation
 Yan, LHale, JJLynch, CLBudhu, RGentry, AMills, SGHajdu, RKeohane, CARosenbach, MJMilligan, JAShei, GJChrebet, GBergstrom, JCard, DRosen, HMandala, SM Design and synthesis of conformationally constrained 3-(N-alkylamino)propylphosphonic acids as potent agonists of sphingosine-1-phosphate (S1P) receptors. Bioorg Med Chem Lett 14:4861-6 (2004)  
Target
Name:
Sphingosine 1-phosphate receptor 2
Synonyms:
EDG5 S1PR2 Sphingosine 1-phosphate receptor Sphingosine-1-phosphate receptor 2 | ndothelial differentiation G-protein coupled receptor 5
Type:
G Protein-Coupled Receptor (GPCR)
Mol. Mass.:
38883.16
Organism:
Homo sapiens (Human)
Description:
Membranes isolated from S1P2-transfected CHO cells were used in ligand binding assay.
Residue:
353
  
Inhibitor
Name:
BDBM50148394
Synonyms:
CHEMBL118860 | [3-(4-Nonyl-benzylamino)-propyl]-phosphonic acid
Type:
Small organic molecule
Emp. Form.:
C19H34NO3P
Mol. Mass.:
355.4519
SMILES:
CCCCCCCCCc1ccc(CNCCCP(O)(O)=O)cc1
: