Target
Carbonic anhydrase 1
Ligand
BDBM26991
Substrate
Meas. Tech.
ChEMBL_302607 (CHEMBL839657)
Ki
18000000±n/a nM
Citation
 Innocenti, AFirnges, MAAntel, JWurl, MScozzafava, ASupuran, CT Carbonic anhydrase inhibitors: inhibition of the membrane-bound human isozyme IV with anions. Bioorg Med Chem Lett 14:5769-73 (2004)  
Target
Name:
Carbonic anhydrase 1
Synonyms:
CA-I CAB Carbonate dehydratase I Carbonic anhydrase 1 (CA I) Carbonic anhydrase 1 (Recombinant CA I) Carbonic anhydrase B Carbonic anhydrase I (CA I) Carbonic anhydrase I (CAI) Carbonic anhydrase isoenzyme I (hCA I) | hCA
Type:
Enzyme
Mol. Mass.:
28873.37
Organism:
Homo sapiens (Human)
Description:
P00915
Residue:
261
  
Inhibitor
Name:
BDBM26991
Synonyms:
CHEMBL1689285 bisulfite | hydrogen sulfite
Type:
Ion
Emp. Form.:
HO3S
Mol. Mass.:
81.072
SMILES:
OS([O-])=O
: