Target
Carbonic anhydrase 1
Ligand
BDBM50155552
Substrate
Meas. Tech.
ChEMBL_302855 (CHEMBL828771)
Ki
36±n/a nM
Citation
 Chazalette, CMasereel, BRolin, SThiry, AScozzafava, AInnocenti, ASupuran, CT Carbonic anhydrase inhibitors. Design of anticonvulsant sulfonamides incorporating indane moieties. Bioorg Med Chem Lett 14:5781-6 (2004)  
Target
Name:
Carbonic anhydrase 1
Synonyms:
CA-I CAB Carbonate dehydratase I Carbonic anhydrase 1 (CA I) Carbonic anhydrase 1 (Recombinant CA I) Carbonic anhydrase B Carbonic anhydrase I (CA I) Carbonic anhydrase I (CAI) Carbonic anhydrase isoenzyme I (hCA I) | hCA
Type:
Enzyme
Mol. Mass.:
28873.37
Organism:
Homo sapiens (Human)
Description:
P00915
Residue:
261
  
Inhibitor
Name:
BDBM50155552
Synonyms:
4-Chloro-N-(5-sulfamoyl-indan-2-yl)-benzamide CHEMBL364127
Type:
Small organic molecule
Emp. Form.:
C16H15ClN2O3S
Mol. Mass.:
350.82
SMILES:
NS(=O)(=O)c1ccc2CC(Cc2c1)NC(=O)c1ccc(Cl)cc1
: