Target
Oxysterols receptor LXR-alpha
Ligand
BDBM50126018
Substrate
Meas. Tech.
ChEMBL_304312 (CHEMBL830107)
EC50
35±n/a nM
Citation
 Singh, SBOndeyka, JGLiu, WChen, SChen, TSLi, XBouffard, ADropinski, JJones, ABMcCormick, SHayes, NWang, JSharma, NMacnaul, KHernandez, MChao, YSBaffic, JLam, MHBurton, CSparrow, CPMenke, JG Discovery and development of dimeric podocarpic acid leads as potent agonists of liver X receptor with HDL cholesterol raising activity in mice and hamsters. Bioorg Med Chem Lett 15:2824-8 (2005)  
Target
Name:
Oxysterols receptor LXR-alpha
Synonyms:
LXRA Liver X receptor alpha Liver X receptor alpha (NR1H3) NR1H3 Nuclear orphan receptor LXR-alpha | Nuclear receptor subfamily 1 group H member 3
Type:
Enzyme Catalytic Domain
Mol. Mass.:
50403.85
Organism:
Homo sapiens (Human)
Description:
Q13133
Residue:
447
  
Inhibitor
Name:
BDBM50126018
Synonyms:
2-(3-chloro-4-(3-(7-propyl-3-(trifluoromethyl)benzo[d]isoxazol-6-yloxy)propylthio)phenyl)acetic acid {3-Chloro-4-[3-(7-propyl-3-trifluoromethyl-benzo[d]isoxazol-6-yloxy)-propylsulfanyl]-phenyl}-acetic acid | {3-chloro-4-[(3-{[7-propyl-3-(trifluoromethyl)-1,2-benzisoxazol-6-yl]oxy}propyl)sulfanyl]phenyl}acetic acid
Type:
Small organic molecule
Emp. Form.:
C22H21ClF3NO4S
Mol. Mass.:
487.92
SMILES:
CCCc1c(OCCCSc2ccc(CC(O)=O)cc2Cl)ccc2c(noc12)C(F)(F)F
: