Target
Prostaglandin E2 receptor EP2 subtype
Ligand
BDBM50167892
Substrate
Meas. Tech.
ChEMBL_303234 (CHEMBL827199)
Ki
>1000±n/a nM
Citation
 Hattori, KTanaka, AOkitsu, OTabuchi, STaniguchi, KNishio, MKoyama, SHigaki, MSeki, JSakane, K Discovery of diphenylcarbamate derivatives as highly potent and selective IP receptor agonists: orally active prostacyclin mimetics. Part 3. Bioorg Med Chem Lett 15:3091-5 (2005)  
Target
Name:
Prostaglandin E2 receptor EP2 subtype
Synonyms:
PE2R2_HUMAN PTGER2 Prostaglandin E2 receptor Prostanoid EP2 Receptor
Type:
Enzyme
Mol. Mass.:
39775.71
Organism:
Homo sapiens (Human)
Description:
P43116
Residue:
358
  
Inhibitor
Name:
BDBM50167892
Synonyms:
CHEMBL195456 | {(S)-6-[(Diphenylcarbamoyloxy)-methyl]-5,6-dihydroxy-5,6,7,8-tetrahydro-naphthalen-1-yloxy}-acetic acid
Type:
Small organic molecule
Emp. Form.:
C26H25NO7
Mol. Mass.:
463.4792
SMILES:
O[C@@H]1c2cccc(OCC(O)=O)c2CC[C@]1(O)COC(=O)N(c1ccccc1)c1ccccc1
: