Target
Prostacyclin receptor
Ligand
BDBM50167892
Substrate
Meas. Tech.
ChEMBL_303292 (CHEMBL828285)
Ki
110±n/a nM
Citation
 Hattori, KTanaka, AOkitsu, OTabuchi, STaniguchi, KNishio, MKoyama, SHigaki, MSeki, JSakane, K Discovery of diphenylcarbamate derivatives as highly potent and selective IP receptor agonists: orally active prostacyclin mimetics. Part 3. Bioorg Med Chem Lett 15:3091-5 (2005)  
Target
Name:
Prostacyclin receptor
Synonyms:
PGI receptor PRIPR Prostacyclin (IP) Receptor Prostaglandin I Prostaglandin I2 receptor | Prostanoid IP receptor
Type:
G Protein-Coupled Receptor (GPCR)
Mol. Mass.:
40968.22
Organism:
Homo sapiens (Human)
Description:
The membranes prepared from human platelet were used in binding assay.
Residue:
386
  
Inhibitor
Name:
BDBM50167892
Synonyms:
CHEMBL195456 | {(S)-6-[(Diphenylcarbamoyloxy)-methyl]-5,6-dihydroxy-5,6,7,8-tetrahydro-naphthalen-1-yloxy}-acetic acid
Type:
Small organic molecule
Emp. Form.:
C26H25NO7
Mol. Mass.:
463.4792
SMILES:
O[C@@H]1c2cccc(OCC(O)=O)c2CC[C@]1(O)COC(=O)N(c1ccccc1)c1ccccc1
: