Target
Carbonic anhydrase 9
Ligand
BDBM50167353
Substrate
Meas. Tech.
ChEMBL_302318 (CHEMBL828906)
Ki
1±n/a nM
Citation
 Garaj, VPuccetti, LFasolis, GWinum, JYMontero, JLScozzafava, AVullo, DInnocenti, ASupuran, CT Carbonic anhydrase inhibitors: novel sulfonamides incorporating 1,3,5-triazine moieties as inhibitors of the cytosolic and tumour-associated carbonic anhydrase isozymes I, II and IX. Bioorg Med Chem Lett 15:3102-8 (2005)  
Target
Name:
Carbonic anhydrase 9
Synonyms:
CA-IX CAH9_HUMAN Carbonic anhydrase 9 (CA IX) Carbonic anhydrase 9 precursor Carbonic anhydrase IX (CAIX) Carbonic anhydrases; II & IX MN RCC-associated antigen G250
Type:
Enzyme
Mol. Mass.:
49669.03
Organism:
Homo sapiens (Human)
Description:
Catalytic domain of human cloned isozyme was used in the assay
Residue:
459
  
Inhibitor
Name:
BDBM50167353
Synonyms:
4-[2-(4,6-Diamino-[1,3,5]triazin-2-ylamino)-ethyl]-benzenesulfonamide | CHEMBL364754
Type:
Small organic molecule
Emp. Form.:
C11H15N7O2S
Mol. Mass.:
309.348
SMILES:
Nc1nc(N)nc(NCCc2ccc(cc2)S(N)(=O)=O)n1
: