Target
Carbonic anhydrase 2
Ligand
BDBM50167355
Substrate
Meas. Tech.
ChEMBL_302314 (CHEMBL828903)
Ki
32±n/a nM
Citation
 Garaj, VPuccetti, LFasolis, GWinum, JYMontero, JLScozzafava, AVullo, DInnocenti, ASupuran, CT Carbonic anhydrase inhibitors: novel sulfonamides incorporating 1,3,5-triazine moieties as inhibitors of the cytosolic and tumour-associated carbonic anhydrase isozymes I, II and IX. Bioorg Med Chem Lett 15:3102-8 (2005)  
Target
Name:
Carbonic anhydrase 2
Synonyms:
CA-II CAC Carbonate dehydratase II Carbonic anhydrase 2 (CA-II) Carbonic anhydrase C Carbonic anhydrase II (CA-II) Carbonic anhydrase II (hCA II) | Carbonic anhydrase isoenzyme II (hCA II)
Type:
Enzyme
Mol. Mass.:
29250.71
Organism:
Homo sapiens (Human)
Description:
P00918
Residue:
260
  
Inhibitor
Name:
BDBM50167355
Synonyms:
CHEMBL189526 | {4-Chloro-6-[2-(4-sulfamoyl-phenyl)-ethylamino]-[1,3,5]triazin-2-ylamino}-acetic acid
Type:
Small organic molecule
Emp. Form.:
C13H15ClN6O4S
Mol. Mass.:
386.814
SMILES:
NS(=O)(=O)c1ccc(CCNc2nc(Cl)nc(NCC(O)=O)n2)cc1
: