Target
5-hydroxytryptamine receptor 6
Ligand
BDBM50169596
Substrate
Meas. Tech.
ChEMBL_302678 (CHEMBL839441)
Ki
2400±n/a nM
Citation
 Abate, CKolanos, RDukat, MSetola, VRoth, BLGlennon, RA Interaction of chiral MS-245 analogs at h5-HT6 receptors. Bioorg Med Chem Lett 15:3510-3 (2005)  
Target
Name:
5-hydroxytryptamine receptor 6
Synonyms:
5-HT-6 5-hydroxytryptamine receptor 6 (5-HT-6) 5-hydroxytryptamine receptor 6 (5HT6) HTR6 Serotonin 6 (5-HT6) receptor | Serotonin Receptor 6
Type:
G Protein-Coupled Receptor (GPCR)
Mol. Mass.:
46968.43
Organism:
Homo sapiens (Human)
Description:
P50406
Residue:
440
  
Inhibitor
Name:
BDBM50169596
Synonyms:
3-(S)-1-Pyrrolidin-2-ylmethyl-1H-indole; hydrochloride | CHEMBL534703
Type:
Small organic molecule
Emp. Form.:
C13H16N2
Mol. Mass.:
200.2795
SMILES:
C([C@@H]1CCCN1)c1c[nH]c2ccccc12
: