Target
Carbonic anhydrase 9
Ligand
BDBM10864
Substrate
Meas. Tech.
ChEMBL_303196 (CHEMBL829822)
Ki
269±n/a nM
Citation
 Nishimori, IVullo, DInnocenti, AScozzafava, AMastrolorenzo, ASupuran, CT Carbonic anhydrase inhibitors: inhibition of the transmembrane isozyme XIV with sulfonamides. Bioorg Med Chem Lett 15:3828-33 (2005)  
Target
Name:
Carbonic anhydrase 9
Synonyms:
CA-IX CAH9_HUMAN Carbonic anhydrase 9 (CA IX) Carbonic anhydrase 9 precursor Carbonic anhydrase IX (CAIX) Carbonic anhydrases; II & IX MN RCC-associated antigen G250
Type:
Enzyme
Mol. Mass.:
49669.03
Organism:
Homo sapiens (Human)
Description:
Catalytic domain of human cloned isozyme was used in the assay
Residue:
459
  
Inhibitor
Name:
BDBM10864
Synonyms:
4-Amino-3-bromobenzenesulfonamide CHEMBL6724 halogenosulfanilamide deriv. 5d
Type:
Small organic molecule
Emp. Form.:
C6H7BrN2O2S
Mol. Mass.:
251.101
SMILES:
Nc1ccc(cc1Br)S(N)(=O)=O
: