Target
Carbonic anhydrase 9
Ligand
BDBM10866
Substrate
Meas. Tech.
ChEMBL_303196 (CHEMBL829822)
Ki
24±n/a nM
Citation
 Nishimori, IVullo, DInnocenti, AScozzafava, AMastrolorenzo, ASupuran, CT Carbonic anhydrase inhibitors: inhibition of the transmembrane isozyme XIV with sulfonamides. Bioorg Med Chem Lett 15:3828-33 (2005)  
Target
Name:
Carbonic anhydrase 9
Synonyms:
CA-IX CAH9_HUMAN Carbonic anhydrase 9 (CA IX) Carbonic anhydrase 9 precursor Carbonic anhydrase IX (CAIX) Carbonic anhydrases; II & IX MN RCC-associated antigen G250
Type:
Enzyme
Mol. Mass.:
49669.03
Organism:
Homo sapiens (Human)
Description:
Catalytic domain of human cloned isozyme was used in the assay
Residue:
459
  
Inhibitor
Name:
BDBM10866
Synonyms:
4-amino-6-(trifluoromethyl)benzene-1,3-disulfonamide aromatic/heteroaromatic sulfonamide 11
Type:
Small organic molecule
Emp. Form.:
C7H8F3N3O4S2
Mol. Mass.:
319.281
SMILES:
Nc1cc(c(cc1S(N)(=O)=O)S(N)(=O)=O)C(F)(F)F
: