Target
Metabotropic glutamate receptor 8
Ligand
BDBM50004051
Substrate
Meas. Tech.
ChEMBL_306301 (CHEMBL828593)
IC50
5.1±n/a nM
Citation
 Wheeler, WJClodfelter, DKCollado, IKulanthaivel, PPedregal, CStoddard, EAWright, RASchoepp, DD (2S,1'S,2'R,3'R)-2(2'-Carboxy-3'-hydroxymethylcyclopropyl)glycine-[3H], a potent and selective radioligand for labeling group 2 and 3 metabotropic glutamate receptors. Bioorg Med Chem Lett 15:349-51 (2004)  
Target
Name:
Metabotropic glutamate receptor 8
Synonyms:
GPRC1H GRM8_HUMAN Metabotropic glutamate receptor 8 | metabotropic glutamate 8
Type:
Enzyme Catalytic Domain
Mol. Mass.:
101759.58
Organism:
Homo sapiens (Human)
Description:
metabotropic glutamate 8 GRM8 HUMAN::O00222
Residue:
908
  
Inhibitor
Name:
BDBM50004051
Synonyms:
2-Amino-4-phosphono-butyric acid 4-Amino Phosphonobutyrate GlcN-6-P synthase inhibitor, 1 (racemic mixture) | L-AP4
Type:
Small organic molecule
Emp. Form.:
C4H10NO5P
Mol. Mass.:
183.0997
SMILES:
NC(CCP(O)(O)=O)C(O)=O
: