Target
Carbonic anhydrase 9
Ligand
BDBM50157949
Substrate
Meas. Tech.
ChEMBL_303516 (CHEMBL839630)
Ki
31±n/a nM
Citation
 Turkmen, HDurgun, MYilmaztekin, SEmul, MInnocenti, AVullo, DScozzafava, ASupuran, CT Carbonic anhydrase inhibitors. Novel sulfanilamide/acetazolamide derivatives obtained by the tail approach and their interaction with the cytosolic isozymes I and II, and the tumor-associated isozyme IX. Bioorg Med Chem Lett 15:367-72 (2004)  
Target
Name:
Carbonic anhydrase 9
Synonyms:
CA-IX CAH9_HUMAN Carbonic anhydrase 9 (CA IX) Carbonic anhydrase 9 precursor Carbonic anhydrase IX (CAIX) Carbonic anhydrases; II & IX MN RCC-associated antigen G250
Type:
Enzyme
Mol. Mass.:
49669.03
Organism:
Homo sapiens (Human)
Description:
Catalytic domain of human cloned isozyme was used in the assay
Residue:
459
  
Inhibitor
Name:
BDBM50157949
Synonyms:
2-(4-Methyl-piperazin-1-yl)-N-(5-sulfamoyl-[1,3,4]thiadiazol-2-yl)-acetamide CHEMBL179897
Type:
Small organic molecule
Emp. Form.:
C9H16N6O3S2
Mol. Mass.:
320.392
SMILES:
CN1CCN(CC(=O)Nc2nnc(s2)S(N)(=O)=O)CC1
: