Target
Carbonic anhydrase 2
Ligand
BDBM50157956
Substrate
Meas. Tech.
ChEMBL_303334 (CHEMBL840150)
Ki
104±n/a nM
Citation
 Turkmen, HDurgun, MYilmaztekin, SEmul, MInnocenti, AVullo, DScozzafava, ASupuran, CT Carbonic anhydrase inhibitors. Novel sulfanilamide/acetazolamide derivatives obtained by the tail approach and their interaction with the cytosolic isozymes I and II, and the tumor-associated isozyme IX. Bioorg Med Chem Lett 15:367-72 (2004)  
Target
Name:
Carbonic anhydrase 2
Synonyms:
CA-II CAC Carbonate dehydratase II Carbonic anhydrase 2 (CA-II) Carbonic anhydrase C Carbonic anhydrase II (CA-II) Carbonic anhydrase II (hCA II) | Carbonic anhydrase isoenzyme II (hCA II)
Type:
Enzyme
Mol. Mass.:
29250.71
Organism:
Homo sapiens (Human)
Description:
P00918
Residue:
260
  
Inhibitor
Name:
BDBM50157956
Synonyms:
4-Morpholin-4-yl-N-(4-sulfamoyl-phenyl)-butyramide | CHEMBL360041
Type:
Small organic molecule
Emp. Form.:
C14H21N3O4S
Mol. Mass.:
327.399
SMILES:
NS(=O)(=O)c1ccc(NC(=O)CCCN2CCOCC2)cc1
: