Target
Carbonic anhydrase 9
Ligand
BDBM50159803
Substrate
Meas. Tech.
ChEMBL_303142 (CHEMBL829116)
Ki
525±n/a nM
Citation
 Winum, JYPastorekova, SJakubickova, LMontero, JLScozzafava, APastorek, JVullo, DInnocenti, ASupuran, CT Carbonic anhydrase inhibitors: synthesis and inhibition of cytosolic/tumor-associated carbonic anhydrase isozymes I, II, and IX with bis-sulfamates. Bioorg Med Chem Lett 15:579-84 (2005)  
Target
Name:
Carbonic anhydrase 9
Synonyms:
CA-IX CAH9_HUMAN Carbonic anhydrase 9 (CA IX) Carbonic anhydrase 9 precursor Carbonic anhydrase IX (CAIX) Carbonic anhydrases; II & IX MN RCC-associated antigen G250
Type:
Enzyme
Mol. Mass.:
49669.03
Organism:
Homo sapiens (Human)
Description:
Catalytic domain of human cloned isozyme was used in the assay
Residue:
459
  
Inhibitor
Name:
BDBM50159803
Synonyms:
CHEMBL181753 | Sulfamic acid 16-sulfamoyloxy-hexadecyl ester
Type:
Small organic molecule
Emp. Form.:
C16H36N2O6S2
Mol. Mass.:
416.597
SMILES:
NS(=O)(=O)OCCCCCCCCCCCCCCCCOS(N)(=O)=O
: