Target
Sodium-dependent dopamine transporter
Ligand
BDBM50160894
Substrate
Meas. Tech.
ChEMBL_303179 (CHEMBL829673)
Ki
52±n/a nM
Citation
 Tamagnan, GAlagille, DFu, XKula, NSBaldessarini, RJInnis, RBBaldwin, RM Synthesis and monoamine transporter affinity of new 2beta-carbomethoxy-3beta-[4-(substituted thiophenyl)]phenyltropanes: discovery of a selective SERT antagonist with picomolar potency. Bioorg Med Chem Lett 15:1131-3 (2005)  
Target
Name:
Sodium-dependent dopamine transporter
Synonyms:
DA transporter SC6A3_RAT Sodium-dependent dopamine transporter | Sodium-dependent dopamine transporter (DAT)
Type:
Multi-pass membrane protein
Mol. Mass.:
68749.45
Organism:
Rattus norvegicus (rat)
Description:
P23977
Residue:
619
  
Inhibitor
Name:
BDBM50160894
Synonyms:
8-Methyl-3-(4-thiophen-2-yl-phenyl)-8-aza-bicyclo[3.2.1]octane-2-carboxylic acid methyl ester | CHEMBL181609
Type:
Small organic molecule
Emp. Form.:
C20H23NO2S
Mol. Mass.:
341.467
SMILES:
COC(=O)C1C2CCC(CC1c1ccc(cc1)-c1cccs1)N2C
: