Target
Transporter
Ligand
BDBM50160895
Substrate
Meas. Tech.
ChEMBL_303312 (CHEMBL840038)
Ki
324±n/a nM
Citation
 Tamagnan, GAlagille, DFu, XKula, NSBaldessarini, RJInnis, RBBaldwin, RM Synthesis and monoamine transporter affinity of new 2beta-carbomethoxy-3beta-[4-(substituted thiophenyl)]phenyltropanes: discovery of a selective SERT antagonist with picomolar potency. Bioorg Med Chem Lett 15:1131-3 (2005)  
Target
Name:
Transporter
Synonyms:
Monoamine transporters; Norepininephrine & dopamine | Norepinephrine Monoamine transporters
Type:
PROTEIN
Mol. Mass.:
66787.87
Organism:
Rattus norvegicus
Description:
ChEMBL_1463061
Residue:
597
  
Inhibitor
Name:
BDBM50160895
Synonyms:
3-[4-(5-Bromo-thiophen-2-yl)-phenyl]-8-methyl-8-aza-bicyclo[3.2.1]octane-2-carboxylic acid methyl ester | CHEMBL180918
Type:
Small organic molecule
Emp. Form.:
C20H22BrNO2S
Mol. Mass.:
420.363
SMILES:
COC(=O)C1C2CCC(CC1c1ccc(cc1)-c1ccc(Br)s1)N2C
: