Target
Sodium-dependent dopamine transporter
Ligand
BDBM50160899
Substrate
Meas. Tech.
ChEMBL_303179 (CHEMBL829673)
Ki
>30000±n/a nM
Citation
 Tamagnan, GAlagille, DFu, XKula, NSBaldessarini, RJInnis, RBBaldwin, RM Synthesis and monoamine transporter affinity of new 2beta-carbomethoxy-3beta-[4-(substituted thiophenyl)]phenyltropanes: discovery of a selective SERT antagonist with picomolar potency. Bioorg Med Chem Lett 15:1131-3 (2005)  
Target
Name:
Sodium-dependent dopamine transporter
Synonyms:
DA transporter SC6A3_RAT Sodium-dependent dopamine transporter | Sodium-dependent dopamine transporter (DAT)
Type:
Multi-pass membrane protein
Mol. Mass.:
68749.45
Organism:
Rattus norvegicus (rat)
Description:
P23977
Residue:
619
  
Inhibitor
Name:
BDBM50160899
Synonyms:
3-[4-(4,5-Dinitro-thiophen-2-yl)-phenyl]-8-methyl-8-aza-bicyclo[3.2.1]octane-2-carboxylic acid methyl ester | CHEMBL180618
Type:
Small organic molecule
Emp. Form.:
C20H21N3O6S
Mol. Mass.:
431.462
SMILES:
COC(=O)C1C2CCC(CC1c1ccc(cc1)-c1cc(c(s1)[N+]([O-])=O)[N+]([O-])=O)N2C
: