Target
Carbonic anhydrase 2
Ligand
BDBM10866
Substrate
Meas. Tech.
ChEMBL_302668 (CHEMBL839012)
Ki
63±n/a nM
Citation
 Innocenti, AFirnges, MAAntel, JWurl, MScozzafava, ASupuran, CT Carbonic anhydrase inhibitors. Inhibition of the membrane-bound human and bovine isozymes IV with sulfonamides. Bioorg Med Chem Lett 15:1149-54 (2005)  
Target
Name:
Carbonic anhydrase 2
Synonyms:
CA-II CAC Carbonate dehydratase II Carbonic anhydrase 2 (CA-II) Carbonic anhydrase C Carbonic anhydrase II (CA-II) Carbonic anhydrase II (hCA II) | Carbonic anhydrase isoenzyme II (hCA II)
Type:
Enzyme
Mol. Mass.:
29250.71
Organism:
Homo sapiens (Human)
Description:
P00918
Residue:
260
  
Inhibitor
Name:
BDBM10866
Synonyms:
4-amino-6-(trifluoromethyl)benzene-1,3-disulfonamide aromatic/heteroaromatic sulfonamide 11
Type:
Small organic molecule
Emp. Form.:
C7H8F3N3O4S2
Mol. Mass.:
319.281
SMILES:
Nc1cc(c(cc1S(N)(=O)=O)S(N)(=O)=O)C(F)(F)F
: