Target
Reverse transcriptase/RNaseH
Ligand
BDBM50370476
Substrate
Meas. Tech.
ChEMBL_306023 (CHEMBL833538)
IC50
2100±n/a nM
Citation
 Summerer, DMarx, A 4'C-ethynyl-thymidine acts as a chain terminator during DNA-synthesis catalyzed by HIV-1 reverse transcriptase. Bioorg Med Chem Lett 15:869-71 (2005)  
Target
Name:
Reverse transcriptase/RNaseH
Synonyms:
HIV-1 Reverse Transcriptase RNase H Reverse transcriptase/RNaseH
Type:
PROTEIN
Mol. Mass.:
65229.15
Organism:
Human immunodeficiency virus 1
Description:
ChEMBL_1473730
Residue:
566
  
Inhibitor
Name:
BDBM50370476
Synonyms:
Combivir | ZIDOVUDINE TRIPHOSPHATE
Type:
Small organic molecule
Emp. Form.:
C10H16N5O13P3
Mol. Mass.:
507.181
SMILES:
Cc1cn([C@H]2C[C@H](N=[N+]=[N-])[C@@H](CO[P@@](O)(=O)O[P@@](O)(=O)OP(O)(O)=O)O2)c(=O)[nH]c1=O
: