Target
Carbonic anhydrase 12
Ligand
BDBM10873
Substrate
Meas. Tech.
ChEMBL_302410 (CHEMBL828815)
Ki
3.4±n/a nM
Citation
 Vullo, DInnocenti, ANishimori, IPastorek, JScozzafava, APastoreková, SSupuran, CT Carbonic anhydrase inhibitors. Inhibition of the transmembrane isozyme XII with sulfonamides-a new target for the design of antitumor and antiglaucoma drugs? Bioorg Med Chem Lett 15:963-9 (2005)  
Target
Name:
Carbonic anhydrase 12
Synonyms:
CA-XII CAH12_HUMAN Carbonic anhydrase Carbonic anhydrase XII Carbonic anhydrase XII (CAXII) | Tumor antigen HOM-RCC-3.1.3
Type:
Enzyme
Mol. Mass.:
39456.00
Organism:
Homo sapiens (Human)
Description:
Catalytic domain of human cloned isozyme was used in the assay
Residue:
354
  
Inhibitor
Name:
BDBM10873
Synonyms:
4-[(2-aminopyrimidin-4-yl)amino]benzene-1-sulfonamide US9616064, Compound 1aa | aromatic/heteroaromatic sulfonamide 18
Type:
Small organic molecule
Emp. Form.:
C10H11N5O2S
Mol. Mass.:
265.292
SMILES:
Nc1nccc(Nc2ccc(cc2)S(N)(=O)=O)n1
: