Target
Carbonic anhydrase 7
Ligand
BDBM10859
Substrate
Meas. Tech.
ChEMBL_302350 (CHEMBL828071)
Ki
88±n/a nM
Citation
 Vullo, DVoipio, JInnocenti, ARivera, CRanki, HScozzafava, AKaila, KSupuran, CT Carbonic anhydrase inhibitors. Inhibition of the human cytosolic isozyme VII with aromatic and heterocyclic sulfonamides. Bioorg Med Chem Lett 15:971-6 (2005)  
Target
Name:
Carbonic anhydrase 7
Synonyms:
CA-VII CAH7_HUMAN Carbonic anhydrase Carbonic anhydrase VII (CA VII)
Type:
Enzyme
Mol. Mass.:
29664.11
Organism:
Homo sapiens (Human)
Description:
Human cloned isozyme.
Residue:
264
  
Inhibitor
Name:
BDBM10859
Synonyms:
4-methylbenzene-1-sulfonamide aromatic/heteroaromatic sulfonamide 4 | hCA inhibitor, 7
Type:
Small organic molecule
Emp. Form.:
C7H9NO2S
Mol. Mass.:
171.217
SMILES:
Cc1ccc(cc1)S(N)(=O)=O
: