Target
Dipeptidyl peptidase 4
Ligand
BDBM50161367
Substrate
Meas. Tech.
ChEMBL_305532 (CHEMBL877009)
IC50
4710±n/a nM
Citation
 Ahn, JHKim, JAKim, HMKwon, HMHuh, SCRhee, SDKim, KRYang, SDPark, SDLee, JMKim, SSCheon, HG Synthesis and evaluation of pyrazolidine derivatives as dipeptidyl peptidase IV (DP-IV) inhibitors. Bioorg Med Chem Lett 15:1337-40 (2005)  
Target
Name:
Dipeptidyl peptidase 4
Synonyms:
Bile canaliculus domain-specific membrane glycoprotein Cd26 DPP4_RAT Dipeptidyl peptidase 4 Dipeptidyl peptidase 4 60 kDa soluble form Dipeptidyl peptidase 4 soluble form Dipeptidyl peptidase IV 60 kDa soluble form Dipeptidyl peptidase IV soluble form GP110 glycoprotein | T-cell activation antigen CD26
Type:
Enzyme
Mol. Mass.:
88084.94
Organism:
Rattus norvegicus (rat)
Description:
Residue:
767
  
Inhibitor
Name:
BDBM50161367
Synonyms:
2-((S)-2-Amino-3-methyl-pentanoyl)-pyrazolidine-1-carboxylic acid (3-chloro-4-nitro-phenyl)-amide; hydrochloride | CHEMBL538074
Type:
Small organic molecule
Emp. Form.:
C16H22ClN5O4
Mol. Mass.:
383.83
SMILES:
CCC(C)[C@H](N)C(=O)N1CCCN1C(=O)Nc1ccc(c(Cl)c1)[N+]([O-])=O
: