Target
Neuronal acetylcholine receptor subunit alpha-7
Ligand
BDBM50164934
Substrate
Meas. Tech.
ChEMBL_303552 (CHEMBL828952)
Ki
10±n/a nM
Citation
 Mazurov, AKlucik, JMiao, LPhillips, TYSeamans, ASchmitt, JDHauser, TAJohnson, RTMiller, C 2-(Arylmethyl)-3-substituted quinuclidines as selective alpha 7 nicotinic receptor ligands. Bioorg Med Chem Lett 15:2073-7 (2005)  
Target
Name:
Neuronal acetylcholine receptor subunit alpha-7
Synonyms:
ACHA7_RAT Cholinergic, Nicotinic Alpha7 Chrna7 Neuronal acetylcholine receptor (alpha7 nAChR) Neuronal acetylcholine receptor subunit alpha-7 Neuronal acetylcholine receptor subunit alpha-7 (nAChR)
Type:
Enzyme
Mol. Mass.:
56502.44
Organism:
Rattus norvegicus (Rat)
Description:
Q05941
Residue:
502
  
Inhibitor
Name:
BDBM50164934
Synonyms:
(4-Bromo-phenyl)-carbamic acid (2R,3R)-2-imidazol-1-ylmethyl-1-aza-bicyclo[2.2.2]oct-3-yl ester | CHEMBL193743
Type:
Small organic molecule
Emp. Form.:
C18H21BrN4O2
Mol. Mass.:
405.289
SMILES:
Brc1ccc(NC(=O)O[C@@H]2C3CCN(CC3)[C@@H]2Cn2ccnc2)cc1
: