Target
Nitric oxide synthase, inducible
Ligand
BDBM50165432
Substrate
Meas. Tech.
ChEMBL_305519 (CHEMBL827657)
IC50
5600±n/a nM
Citation
 Couch, RDBrowning, RGHonda, TGribble, GWWright, DLSporn, MBAnderson, AC Studies on the reactivity of CDDO, a promising new chemopreventive and chemotherapeutic agent: implications for a molecular mechanism of action. Bioorg Med Chem Lett 15:2215-9 (2005)  
Target
Name:
Nitric oxide synthase, inducible
Synonyms:
HEP-NOS Inducible NO synthase NOS type II NOS2A Nitric oxide synthase, inducible (iNOS) | iNOS
Type:
Homodimer
Mol. Mass.:
131141.95
Organism:
Homo sapiens (Human)
Description:
P35228
Residue:
1153
  
Inhibitor
Name:
BDBM50165432
Synonyms:
(4aS,6aS,6bR,12aR)-2,2,6a,6b,9,9,12a-Heptamethyl-10-oxo-1,3,4,5,6,6a,6b,7,8,8a,9,10,12a,12b,13,14b-hexadecahydro-2H-picene-4a-carboxylic acid | CHEMBL196236
Type:
Small organic molecule
Emp. Form.:
C30H44O3
Mol. Mass.:
452.6686
SMILES:
CC1(C)CC[C@@]2(CC[C@]3(C)C(=CCC4[C@@]5(C)C=CC(=O)C(C)(C)C5CC[C@@]34C)C2C1)C(O)=O
: