Target
Glucocorticoid receptor
Ligand
BDBM50410187
Substrate
Meas. Tech.
ChEMBL_302570 (CHEMBL875218)
Ki
0.21±n/a nM
Citation
 von Geldern, TWTu, NKym, PRLink, JTJae, HSLai, CApelqvist, TRhonnstad, PHagberg, LKoehler, KGrynfarb, MGoos-Nilsson, ASandberg, JOsterlund, MBarkhem, THöglund, MWang, JFung, SWilcox, DNguyen, PJakob, CHutchins, CFärnegårdh, MKauppi, BOhman, LJacobson, PB Liver-selective glucocorticoid antagonists: a novel treatment for type 2 diabetes. J Med Chem 47:4213-30 (2004)  
Target
Name:
Glucocorticoid receptor
Synonyms:
GCR_HUMAN GRL Glucocorticoid receptor (GRFP) Nuclear receptor subfamily 3 group C member 1
Type:
Enzyme
Mol. Mass.:
85656.87
Organism:
Homo sapiens (Human)
Description:
P04150
Residue:
777
  
Inhibitor
Name:
BDBM50410187
Synonyms:
CHEMBL2096804
Type:
Small organic molecule
Emp. Form.:
C55H77NO8
Mol. Mass.:
880.2018
SMILES:
C[C@H](CCC(O)=O)[C@H]1CC[C@H]2[C@@H]3[C@H](O)C[C@@H]4C[C@@H](CC[C@]4(C)[C@H]3C[C@H](O)[C@]12C)OCCOCCN(C)c1ccc(cc1)[C@H]1C[C@@]2(C)[C@@H](CC[C@@]2(O)C#C)[C@@H]2CCC3=CC(=O)CCC3=C12
: