Target
Androgen receptor
Ligand
BDBM50154006
Substrate
Meas. Tech.
ChEMBL_306232 (CHEMBL874560)
IC50
0.1±n/a nM
Citation
 Muddana, SSPrice, AMMacBride, MMPeterson, BR 11beta-alkyl-Delta9-19-nortestosterone derivatives: high-affinity ligands and potent partial agonists of the androgen receptor. J Med Chem 47:4985-8 (2004)  
Target
Name:
Androgen receptor
Synonyms:
ANDR_HUMAN Androgen Receptor Androgen receptor/Baculoviral IAP repeat-containing protein 2 Dihydrotestosterone receptor Nuclear receptor subfamily 3 group C member 4
Type:
Receptor
Mol. Mass.:
99185.27
Organism:
Homo sapiens (Human)
Description:
CHO cells were stably transfected with human AR gene.
Residue:
920
  
Inhibitor
Name:
BDBM50154006
Synonyms:
17-Hydroxy-13-methyl-11-pentyl-1,2,6,7,8,11,12,13,14,15,16,17-dodecahydro-cyclopenta[a]phenanthren-3-one | CHEMBL184313
Type:
Small organic molecule
Emp. Form.:
C23H34O2
Mol. Mass.:
342.5149
SMILES:
CCCCC[C@H]1C[C@]2(C)[C@@H](O)CCC2C2CCC3=CC(=O)CCC3=C12
: