Target
Androgen receptor
Ligand
BDBM50422635
Substrate
Meas. Tech.
ChEMBL_306232 (CHEMBL874560)
IC50
0.200000±n/a nM
Citation
 Muddana, SSPrice, AMMacBride, MMPeterson, BR 11beta-alkyl-Delta9-19-nortestosterone derivatives: high-affinity ligands and potent partial agonists of the androgen receptor. J Med Chem 47:4985-8 (2004)  
Target
Name:
Androgen receptor
Synonyms:
ANDR_HUMAN Androgen Receptor Androgen receptor/Baculoviral IAP repeat-containing protein 2 Dihydrotestosterone receptor Nuclear receptor subfamily 3 group C member 4
Type:
Receptor
Mol. Mass.:
99185.27
Organism:
Homo sapiens (Human)
Description:
CHO cells were stably transfected with human AR gene.
Residue:
920
  
Inhibitor
Name:
BDBM50422635
Synonyms:
CHEMBL2311179
Type:
Small organic molecule
Emp. Form.:
C18H24O2
Mol. Mass.:
272.382
SMILES:
C[C@]12CCC3=C4CCC(=O)C=C4CC[C@H]3[C@@H]1CC[C@@H]2O
: