Target
Mu-type opioid receptor
Ligand
BDBM50154203
Substrate
Meas. Tech.
ChEMBL_303422 (CHEMBL840085)
Ki
114±n/a nM
Citation
 Grundt, PWilliams, IALewis, JWHusbands, SM Identification of a new scaffold for opioid receptor antagonism based on the 2-amino-1,1-dimethyl-7-hydroxytetralin pharmacophore. J Med Chem 47:5069-75 (2004)  
Target
Name:
Mu-type opioid receptor
Synonyms:
M-OR-1 MOR-1 MUOR1 Mu opiate receptor OPRM1 hMOP | mu-type opioid receptor isoform MOR-1
Type:
G Protein-Coupled Receptor (GPCR)
Mol. Mass.:
44789.51
Organism:
Homo sapiens (Human)
Description:
P35372
Residue:
400
  
Inhibitor
Name:
BDBM50154203
Synonyms:
7-(dimethylamino)-8,8-dimethyl-5,6,7,8-tetrahydronaphthalen-2-ol | CHEMBL188841
Type:
Small organic molecule
Emp. Form.:
C14H21NO
Mol. Mass.:
219.3226
SMILES:
CN(C)C1CCc2ccc(O)cc2C1(C)C
: