Target
MO15-related protein kinase Pfmrk
Ligand
BDBM50154598
Substrate
Meas. Tech.
ChEMBL_306159 (CHEMBL832347)
IC50
2500±n/a nM
Citation
 Bhattacharjee, AKGeyer, JAWoodard, CLKathcart, AKNichols, DAPrigge, STLi, ZMott, BTWaters, NC A three-dimensional in silico pharmacophore model for inhibition of Plasmodium falciparum cyclin-dependent kinases and discovery of different classes of novel Pfmrk specific inhibitors. J Med Chem 47:5418-26 (2004)  
Target
Name:
MO15-related protein kinase Pfmrk
Synonyms:
Protein kinase Pfmrk
Type:
PROTEIN
Mol. Mass.:
37992.30
Organism:
Plasmodium falciparum
Description:
ChEMBL_640752
Residue:
324
  
Inhibitor
Name:
BDBM50154598
Synonyms:
5-Chloro-4-nitro-thiophene-2-sulfonic acid (4-trifluoromethyl-phenyl)-amide | CHEMBL363357
Type:
Small organic molecule
Emp. Form.:
C11H6ClF3N2O4S2
Mol. Mass.:
386.755
SMILES:
[O-][N+](=O)c1cc(sc1Cl)S(=O)(=O)Nc1ccc(cc1)C(F)(F)F
: