Target
MO15-related protein kinase Pfmrk
Ligand
BDBM50154618
Substrate
Meas. Tech.
ChEMBL_306159 (CHEMBL832347)
IC50
3100±n/a nM
Citation
 Bhattacharjee, AKGeyer, JAWoodard, CLKathcart, AKNichols, DAPrigge, STLi, ZMott, BTWaters, NC A three-dimensional in silico pharmacophore model for inhibition of Plasmodium falciparum cyclin-dependent kinases and discovery of different classes of novel Pfmrk specific inhibitors. J Med Chem 47:5418-26 (2004)  
Target
Name:
MO15-related protein kinase Pfmrk
Synonyms:
Protein kinase Pfmrk
Type:
PROTEIN
Mol. Mass.:
37992.30
Organism:
Plasmodium falciparum
Description:
ChEMBL_640752
Residue:
324
  
Inhibitor
Name:
BDBM50154618
Synonyms:
5-Bromo-3-(2-oxo-2-phenyl-ethylidene)-1,3-dihydro-indol-2-one CHEMBL363491 | cid_5477132
Type:
Small organic molecule
Emp. Form.:
C16H10BrNO2
Mol. Mass.:
328.16
SMILES:
Brc1ccc2NC(=O)\C(=C/C(=O)c3ccccc3)c2c1
: