Target
Acetylcholinesterase
Ligand
BDBM50039719
Substrate
Meas. Tech.
ChEMBL_305174 (CHEMBL832763)
IC50
20±n/a nM
Citation
 Guo, JHurley, MMWright, JBLushington, GH A docking score function for estimating ligand-protein interactions: application to acetylcholinesterase inhibition. J Med Chem 47:5492-500 (2004)  
Target
Name:
Acetylcholinesterase
Synonyms:
ACES_HUMAN Acetylcholinesterase (AChE) | Acetylcholinesterase (human AChE)
Type:
Enzyme
Mol. Mass.:
67792.70
Organism:
Homo sapiens (Human)
Description:
P22303
Residue:
614
  
Inhibitor
Name:
BDBM50039719
Synonyms:
3-(2-(1-benzylpiperidin-4-yl)ethyl)benzo[d]isoxazol-6-amine CHEMBL420625
Type:
Small organic molecule
Emp. Form.:
C21H25N3O
Mol. Mass.:
335.4427
SMILES:
Nc1ccc2c(CCC3CCN(Cc4ccccc4)CC3)noc2c1
: