Target
Sodium- and chloride-dependent GABA transporter 1
Ligand
BDBM90787
Substrate
Meas. Tech.
ChEMBL_306675 (CHEMBL830009)
IC50
1680±n/a nM
Citation
 Héja, LKovács, ISzárics, EIncze, MTemesváriné-Major, EDörnyei, GPeredy-Kajtár, MGács-Baitz, ESzántay, CKardos, J Novel secoergoline derivatives inhibit both GABA and glutamate uptake in rat brain homogenates: synthesis, in vitro pharmacology, and modeling. J Med Chem 47:5620-9 (2004)  
Target
Name:
Sodium- and chloride-dependent GABA transporter 1
Synonyms:
GABA transporter Gat-1 SC6A1_RAT Solute carrier family 6 member 1
Type:
PROTEIN
Mol. Mass.:
67006.26
Organism:
Rattus norvegicus
Description:
ChEMBL_1472611
Residue:
599
  
Inhibitor
Name:
BDBM90787
Synonyms:
1,2,3,6-tetrahydropyridine-5-carboxylic acid;hydrochloride Guvacine hydrochloride SMR000326834 | cid_11957555
Type:
Small organic molecule
Emp. Form.:
C6H9NO2
Mol. Mass.:
127.1412
SMILES:
OC(=O)C1=CCCNC1
: