Target
Transporter
Ligand
BDBM50156036
Substrate
Meas. Tech.
ChEMBL_303717 (CHEMBL829052)
Ki
0.8±n/a nM
Citation
 Zhou, JHe, RJohnson, KMYe, YKozikowski, AP Piperidine-based nocaine/modafinil hybrid ligands as highly potent monoamine transporter inhibitors: efficient drug discovery by rational lead hybridization. J Med Chem 47:5821-4 (2004)  
Target
Name:
Transporter
Synonyms:
Monoamine transporters; Norepininephrine & dopamine | Norepinephrine Monoamine transporters
Type:
PROTEIN
Mol. Mass.:
66787.87
Organism:
Rattus norvegicus
Description:
ChEMBL_1463061
Residue:
597
  
Inhibitor
Name:
BDBM50156036
Synonyms:
2-[4-(4-Chloro-phenyl)-1-methyl-piperidin-3-ylmethylsulfanyl]-N-isopropyl-acetamide | CHEMBL188557
Type:
Small organic molecule
Emp. Form.:
C18H27ClN2OS
Mol. Mass.:
354.938
SMILES:
CC(C)NC(=O)CSCC1CN(C)CCC1c1ccc(Cl)cc1
: