Target
Transporter
Ligand
BDBM50156056
Substrate
Meas. Tech.
ChEMBL_303717 (CHEMBL829052)
Ki
0.56±n/a nM
Citation
 Zhou, JHe, RJohnson, KMYe, YKozikowski, AP Piperidine-based nocaine/modafinil hybrid ligands as highly potent monoamine transporter inhibitors: efficient drug discovery by rational lead hybridization. J Med Chem 47:5821-4 (2004)  
Target
Name:
Transporter
Synonyms:
Monoamine transporters; Norepininephrine & dopamine | Norepinephrine Monoamine transporters
Type:
PROTEIN
Mol. Mass.:
66787.87
Organism:
Rattus norvegicus
Description:
ChEMBL_1463061
Residue:
597
  
Inhibitor
Name:
BDBM50156056
Synonyms:
CHEMBL188143 | [4-(4-Chloro-phenyl)-piperidin-3-ylmethylsulfanyl]-acetic acid methyl ester
Type:
Small organic molecule
Emp. Form.:
C15H20ClNO2S
Mol. Mass.:
313.843
SMILES:
COC(=O)CSCC1CNCCC1c1ccc(Cl)cc1
: