Target
Transporter
Ligand
BDBM50156041
Substrate
Meas. Tech.
ChEMBL_303717 (CHEMBL829052)
Ki
53±n/a nM
Citation
 Zhou, JHe, RJohnson, KMYe, YKozikowski, AP Piperidine-based nocaine/modafinil hybrid ligands as highly potent monoamine transporter inhibitors: efficient drug discovery by rational lead hybridization. J Med Chem 47:5821-4 (2004)  
Target
Name:
Transporter
Synonyms:
Monoamine transporters; Norepininephrine & dopamine | Norepinephrine Monoamine transporters
Type:
PROTEIN
Mol. Mass.:
66787.87
Organism:
Rattus norvegicus
Description:
ChEMBL_1463061
Residue:
597
  
Inhibitor
Name:
BDBM50156041
Synonyms:
CHEMBL188276 | [4-(4-Chloro-phenyl)-1-methyl-piperidin-3-ylmethanesulfinyl]-acetic acid methyl ester
Type:
Small organic molecule
Emp. Form.:
C16H22ClNO3S
Mol. Mass.:
343.869
SMILES:
COC(=O)CS(=O)CC1CN(C)CCC1c1ccc(Cl)cc1
: