Target
Cytochrome P450 2A6
Ligand
BDBM50158928
Substrate
Meas. Tech.
ChEMBL_302709 (CHEMBL839581)
Ki
520±n/a nM
Citation
 Denton, TTZhang, XCashman, JR 5-substituted, 6-substituted, and unsubstituted 3-heteroaromatic pyridine analogues of nicotine as selective inhibitors of cytochrome P-450 2A6. J Med Chem 48:224-39 (2005)  
Target
Name:
Cytochrome P450 2A6
Synonyms:
1,4-cineole 2-exo-monooxygenase CP2A6_HUMAN CYP2A6 Coumarin 7-hydroxylase Cytochrome P450 IIA3 | Cytochrome P450(I)
Type:
Protein
Mol. Mass.:
56514.34
Organism:
Homo sapiens (Human)
Description:
P11509
Residue:
494
  
Inhibitor
Name:
BDBM50158928
Synonyms:
3-(1-Ethyl-1H-imidazol-4-yl)-pyridine US8609708, 20 | cid_11480732
Type:
Small organic molecule
Emp. Form.:
C10H11N3
Mol. Mass.:
173.2144
SMILES:
CCn1cnc(c1)-c1cccnc1
: