Target
Cytochrome P450 2E1
Ligand
BDBM12352
Substrate
Meas. Tech.
ChEMBL_305743 (CHEMBL829415)
IC50
4100±n/a nM
Citation
 Denton, TTZhang, XCashman, JR 5-substituted, 6-substituted, and unsubstituted 3-heteroaromatic pyridine analogues of nicotine as selective inhibitors of cytochrome P-450 2A6. J Med Chem 48:224-39 (2005)  
Target
Name:
Cytochrome P450 2E1
Synonyms:
CP2E1_HUMAN CYP2E1 | Cytochrome P450 2E1 (CYP2E1)
Type:
Enzyme
Mol. Mass.:
56860.34
Organism:
Homo sapiens (Human)
Description:
P05181
Residue:
493
  
Inhibitor
Name:
BDBM12352
Synonyms:
3-(1-methyl-1H-imidazol-4-yl)pyridine US8609708, 5 nicotine 3-heteroaromatic analogue 5
Type:
Small organic molecule
Emp. Form.:
C9H9N3
Mol. Mass.:
159.1879
SMILES:
Cn1cnc(c1)-c1cccnc1
: