Target
Cytochrome P450 2E1
Ligand
BDBM50158916
Substrate
Meas. Tech.
ChEMBL_305743 (CHEMBL829415)
IC50
34300±n/a nM
Citation
 Denton, TTZhang, XCashman, JR 5-substituted, 6-substituted, and unsubstituted 3-heteroaromatic pyridine analogues of nicotine as selective inhibitors of cytochrome P-450 2A6. J Med Chem 48:224-39 (2005)  
Target
Name:
Cytochrome P450 2E1
Synonyms:
CP2E1_HUMAN CYP2E1 | Cytochrome P450 2E1 (CYP2E1)
Type:
Enzyme
Mol. Mass.:
56860.34
Organism:
Homo sapiens (Human)
Description:
P05181
Residue:
493
  
Inhibitor
Name:
BDBM50158916
Synonyms:
5-Pyridin-3-yl-thiophene-2-carbaldehyde US8609708, 25
Type:
Small organic molecule
Emp. Form.:
C10H7NOS
Mol. Mass.:
189.234
SMILES:
O=Cc1ccc(s1)-c1cccnc1
: