Target
5-hydroxytryptamine receptor 1A
Ligand
BDBM50166899
Substrate
Meas. Tech.
ChEMBL_306666 (CHEMBL831439)
IC50
32.1±n/a nM
Citation
 Childers, WEAbou-Gharbia, MAKelly, MGAndree, THHarrison, BLHo, DMHornby, GHuryn, DMPotestio, LRosenzweig-Lipson, SJSchmid, JSmith, DLSukoff, SJZhang, GSchechter, LE Synthesis and biological evaluation of benzodioxanylpiperazine derivatives as potent serotonin 5-HT(1A) antagonists: the discovery of Lecozotan. J Med Chem 48:3467-70 (2005)  
Target
Name:
5-hydroxytryptamine receptor 1A
Synonyms:
5-HT-1A 5-hydroxytryptamine receptor 1A (5-HT-1A) ADRB2RL1 Dopamine D2 receptor and serotonin 1a receptor HTR1A | Serotonin receptor 1A
Type:
Mol. Mass.:
46122.49
Organism:
Homo sapiens (Human)
Description:
Residue:
422
  
Inhibitor
Name:
BDBM50166899
Synonyms:
CHEMBL435111 | N-{(R)-2-[4-(2,3-Dihydro-benzo[1,4]dioxin-5-yl)-piperazin-1-yl]-propyl}-N-pyridin-2-yl-4-trifluoromethyl-benzamide
Type:
Small organic molecule
Emp. Form.:
C28H29F3N4O3
Mol. Mass.:
526.5501
SMILES:
C[C@H](CN(C(=O)c1ccc(cc1)C(F)(F)F)c1ccccn1)N1CCN(CC1)c1cccc2OCCOc12
: