Target
Coagulation factor X
Ligand
BDBM50167023
Substrate
Meas. Tech.
ChEMBL_304697 (CHEMBL827049)
IC50
400±n/a nM
Citation
 Ueno, HYokota, KHoshi, JYasue, KHayashi, MHase, YUchida, IAisaka, KKatoh, SCho, H Synthesis and structure-activity relationships of novel selective factor Xa inhibitors with a tetrahydroisoquinoline ring. J Med Chem 48:3586-604 (2005)  
Target
Name:
Coagulation factor X
Synonyms:
Activated coagulation factor X (FXa) Coagulation factor X precursor F10 Factor X heavy chain Factor Xa Stuart-Prower factor
Type:
Enzyme
Mol. Mass.:
54726.60
Organism:
Homo sapiens (Human)
Description:
Residue:
488
  
Inhibitor
Name:
BDBM50167023
Synonyms:
1-(4-Carbamimidoyl-phenyl)-4-(2-carbamimidoyl-1,2,3,4-tetrahydro-isoquinolin-7-yloxymethyl)-piperidine-4-carboxylic acid ethyl ester; hydrochloride; trihydrochloride | CHEMBL536961
Type:
Small organic molecule
Emp. Form.:
C26H34N6O3
Mol. Mass.:
478.5866
SMILES:
CCOC(=O)C1(COc2ccc3CCN(Cc3c2)C(N)=N)CCN(CC1)c1ccc(cc1)C(N)=N
: