Target
Prothrombin
Ligand
BDBM50167030
Substrate
Meas. Tech.
ChEMBL_304926 (CHEMBL877331)
IC50
>10000±n/a nM
Citation
 Ueno, HYokota, KHoshi, JYasue, KHayashi, MHase, YUchida, IAisaka, KKatoh, SCho, H Synthesis and structure-activity relationships of novel selective factor Xa inhibitors with a tetrahydroisoquinoline ring. J Med Chem 48:3586-604 (2005)  
Target
Name:
Prothrombin
Synonyms:
Activation peptide fragment 1 Coagulation factor II Prothrombin precursor Thrombin heavy chain | Thrombin light chain
Type:
Protein
Mol. Mass.:
70029.57
Organism:
Homo sapiens (Human)
Description:
P00734
Residue:
622
  
Inhibitor
Name:
BDBM50167030
Synonyms:
4-(2-Carbamimidoyl-2,3,4,5-tetrahydro-1H-benzo[c]azepin-8-yloxymethyl)-3,4,5,6-tetrahydro-2H-[1,4']bipyridinyl-4-carboxylic acid; dihydrochloride | CHEMBL534480
Type:
Small organic molecule
Emp. Form.:
C23H29N5O3
Mol. Mass.:
423.5081
SMILES:
NC(=N)N1CCCc2ccc(OCC3(CCN(CC3)c3ccncc3)C(O)=O)cc2C1
: