Target
D(2) dopamine receptor
Ligand
BDBM50104122
Substrate
Meas. Tech.
ChEMBL_303116 (CHEMBL829625)
Ki
89±n/a nM
Citation
 Newman, AHGrundt, PNader, MA Dopamine D3 receptor partial agonists and antagonists as potential drug abuse therapeutic agents. J Med Chem 48:3663-79 (2005)  
Target
Name:
D(2) dopamine receptor
Synonyms:
Dopamine D2 receptor | Dopamine Receptor D2
Type:
Mol. Mass.:
Description:
ASSAY_ID of EBI is 302528
Components:
This complex has 2 components.
Component 1
Name:
D(2) dopamine receptor
Synonyms:
D(2) dopamine receptor DOPAMINE D2 Long DRD2 Dopamine D2 receptor Dopamine D2 receptor (D2R) Dopamine2-like | d2
Type:
Cell-surface receptors
Mol. Mass.:
50647.10
Organism:
Homo sapiens (Human)
Description:
P14416
Residue:
443
  
Component 2
Name:
D(2) dopamine receptor
Synonyms:
DOPAMINE D2 DOPAMINE D2 Short Dopamine D2 receptor Drd2
Type:
G Protein-Coupled Receptor (GPCR)
Mol. Mass.:
50931.60
Organism:
Rattus norvegicus (rat)
Description:
P61169
Residue:
444
  
Inhibitor
Name:
BDBM50104122
Synonyms:
9-Oxo-9H-fluorene-4-carboxylic acid {4-[4-(2,3-dichloro-phenyl)-piperazin-1-yl]-butyl}-amide | CHEMBL301242
Type:
Small organic molecule
Emp. Form.:
C28H27Cl2N3O2
Mol. Mass.:
508.439
SMILES:
Clc1cccc(N2CCN(CCCCNC(=O)c3cccc4C(=O)c5ccccc5-c34)CC2)c1Cl
: