Target
Endolysin [L99A]
Ligand
BDBM50008560
Substrate
Meas. Tech.
ChEMBL_302213 (CHEMBL826986)
Kd
470000±n/a nM
Citation
 Graves, APBrenk, RShoichet, BK Decoys for docking. J Med Chem 48:3714-28 (2005)  
Target
Name:
Endolysin [L99A]
Synonyms:
E Lysozyme(L99A)
Type:
Mol. Mass.:
18657.83
Organism:
Enterobacteria phage T4
Description:
P00720(L99A)
Residue:
164
  
Inhibitor
Name:
BDBM50008560
Synonyms:
1,2-Dimethylbenzol 1,2-xylene 3,4-xylene o-Xylol | o-xylene
Type:
Small organic molecule
Emp. Form.:
C8H10
Mol. Mass.:
106.165
SMILES:
Cc1ccccc1C
: