Target
Solute carrier family 15 member 1
Ligand
BDBM50022787
Substrate
Meas. Tech.
ChEMBL_302952 (CHEMBL841787)
Ki
>30000000±n/a nM
Citation
 Biegel, AGebauer, SHartrodt, BBrandsch, MNeubert, KThondorf, I Three-dimensional quantitative structure-activity relationship analyses of beta-lactam antibiotics and tripeptides as substrates of the mammalian H+/peptide cotransporter PEPT1. J Med Chem 48:4410-9 (2005)  
Target
Name:
Solute carrier family 15 member 1
Synonyms:
Intestinal H(+)/peptide cotransporter Oligopeptide transporter, small intestine isoform Peptide transporter 1 SLC15A1
Type:
PROTEIN
Mol. Mass.:
78818.07
Organism:
Homo sapiens (Human)
Description:
ChEMBL_1488839
Residue:
708
  
Inhibitor
Name:
BDBM50022787
Synonyms:
(+)-3,3-Dimethyl-7-oxo-6-phenylacetylamino-4-thia-1-aza-bicyclo[3.2.0]heptane-2-carboxylic acid(penicillin G) (2S,5R,6R)-3,3-dimethyl-7-oxo-6-(2-phenylacetamido)-4-thia-1-aza-bicyclo[3.2.0]heptane-2-carboxylic acid 3,3-Dimethyl-7-oxo-6-phenylacetylamino-4-thia-1-aza-bicyclo[3.2.0]heptane-2-carboxylic acid anion (Penicillin G) BICILLIN PENICILLIN G PROCAINE PERMAPEN PFIZERPEN-AS | benzylpenicillin
Type:
Small organic molecule
Emp. Form.:
C16H18N2O4S
Mol. Mass.:
334.39
SMILES:
CC1(C)S[C@@H]2[C@H](NC(=O)Cc3ccccc3)C(=O)N2[C@H]1C(O)=O
: