Target
Solute carrier family 15 member 1
Ligand
BDBM50169212
Substrate
Meas. Tech.
ChEMBL_302952 (CHEMBL841787)
Ki
90000±n/a nM
Citation
 Biegel, AGebauer, SHartrodt, BBrandsch, MNeubert, KThondorf, I Three-dimensional quantitative structure-activity relationship analyses of beta-lactam antibiotics and tripeptides as substrates of the mammalian H+/peptide cotransporter PEPT1. J Med Chem 48:4410-9 (2005)  
Target
Name:
Solute carrier family 15 member 1
Synonyms:
Intestinal H(+)/peptide cotransporter Oligopeptide transporter, small intestine isoform Peptide transporter 1 SLC15A1
Type:
PROTEIN
Mol. Mass.:
78818.07
Organism:
Homo sapiens (Human)
Description:
ChEMBL_1488839
Residue:
708
  
Inhibitor
Name:
BDBM50169212
Synonyms:
2-Amino-N-((S)-2-amino-hexanoyl)-propionamide | CHEMBL190327
Type:
Small organic molecule
Emp. Form.:
C9H19N3O2
Mol. Mass.:
201.2661
SMILES:
CCCC[C@H](N)C(=O)NC(=O)[C@H](C)N
: