Target
Solute carrier family 15 member 1
Ligand
BDBM50292251
Substrate
Meas. Tech.
ChEMBL_302952 (CHEMBL841787)
Ki
>30000000±n/a nM
Citation
 Biegel, AGebauer, SHartrodt, BBrandsch, MNeubert, KThondorf, I Three-dimensional quantitative structure-activity relationship analyses of beta-lactam antibiotics and tripeptides as substrates of the mammalian H+/peptide cotransporter PEPT1. J Med Chem 48:4410-9 (2005)  
Target
Name:
Solute carrier family 15 member 1
Synonyms:
Intestinal H(+)/peptide cotransporter Oligopeptide transporter, small intestine isoform Peptide transporter 1 SLC15A1
Type:
PROTEIN
Mol. Mass.:
78818.07
Organism:
Homo sapiens (Human)
Description:
ChEMBL_1488839
Residue:
708
  
Inhibitor
Name:
BDBM50292251
Synonyms:
4-{((R)-2-Carboxy-3-methoxymethyl-8-oxo-5-thia-1-aza-bicyclo[4.2.0]oct-2-en-7-ylcarbamoyl)-[(Z)-methoxyimino]-methyl}-thiazol-2-yl-ammonium CHEMBL1672
Type:
Small organic molecule
Emp. Form.:
C15H17N5O6S2
Mol. Mass.:
427.455
SMILES:
COCC1=C(N2[C@H](SC1)[C@H](NC(=O)C(=N/OC)\c1csc(N)n1)C2=O)C(O)=O
: